Arrowhead Ontology
type: Ontology
description: Data about systems, services, and devices in the Arrowhead Framework for Industrial IoT
creator: Graxiom-Piaget
version IRI: http://hadatac.org/ont/arrowhead/0.1
version info: 0.1
date: 2025-05-07

INR21700 M50T
type: Class
hasco type: Instrument
comment: Cylindrical rechargeable lithium ion battery
has maker: LG Chem
has web document: https://www.batteryspace.com/prod-specs/11514.pdf

18650
type: Class
hasco type: Instrument
comment: Cylindrical rechargeable lithium ion battery with 18 mm in diameter by 65.0 mm in length
has web document: https://en.wikipedia.org/wiki/18650_battery#:~:text=An%2018650%20battery%20or%201865,a%20cathode%20for%20these%20batteries

Battery Cycling Test
type: Class
comment: A procedure in which a battery is repeatedly charged and discharged to evaluate its performance, durability, and safety.
has web document: https://www.nrel.gov/transportation/battery-lifespan

Constant Current Cycling
type: Class
subclass of: Battery Cycling Test
comment: Battery is charged and discharged at a constant current to measure capacity fade and cycle life.
has web document: https://web.mit.edu/evt/summary_battery_specifications.pdf

Constant Current-Constant Voltage Cycling
type: Class
subclass of: Battery Cycling Test
comment: Charging starts with constant current, then switches to constant voltage until current drops below a threshold.
has web document: https://web.mit.edu/evt/summary_battery_specifications.pdf

Pulse Cycling
type: Class
subclass of: Battery Cycling Test
comment: Battery is subjected to pulses of current to test response to high power demands.
has web document: https://web.mit.edu/evt/summary_battery_specifications.pdf

Dynamic Stress Test
type: Class
subclass of: Battery Cycling Test
comment: Applies a variable load profile to simulate real driving conditions.
has web document: https://www.nrel.gov/transportation/battery-lifespan

Calendar Aging Test
type: Class
subclass of: Battery Cycling Test
comment: Battery is stored at a certain state of charge and temperature to measure degradation over time.
has web document: https://www.nrel.gov/transportation/battery-lifespan

Temperature Cycling
type: Class
subclass of: Battery Cycling Test
comment: Battery is cycled while exposed to varying temperatures to assess thermal stability.
has web document: https://www.nrel.gov/transportation/battery-lifespan

Fast Charging/Discharging Cycling
type: Class
subclass of: Battery Cycling Test
comment: High-rate charge and discharge cycles to test tolerance to rapid energy transfer.
has web document: https://www.nrel.gov/transportation/battery-lifespan

Weather Indoor
type: Class
subclass of: C170964
comment: The state of the atmosphere at a given time and indoor location, with respect to variables such as temperature, moisture, and barometric pressure.

Weather Outdoor
type: Class
subclass of: C170964
comment: The state of the atmosphere at a given time and outdoor location, with respect to variables such as temperature, moisture, wind velocity, and barometric pressure.

LithiumIonBattery
type: Class
equivalent class: Class
  intersection of: Restriction
subclass of: Restriction
comment: a lithium ion battery does not contain lithium metal
EMMO 26bf1bef d192 4da6 b0eb d2209698fb54: https://www.wikidata.org/wiki/Q2822895
EMMO 50c298c2 55a2 4068 b3ac 4e948c33181f: https://www.electropedia.org/iev/iev.nsf/display
EMMO 6dd685dd 1895 46e4 b227 be9f7d643c25: https://dbpedia.org/page/Lithium-ion_battery
EMMO 967080e5 2f42 4eb2 a3a9 c58143e835f9: secondary battery with an organic solvent electrolyte and positive and negative electrodes which utilize an intercalation compound in which lithium is stored
EMMO c84c6752 6d64 48cc 9500 e54a3c34898d: https://en.wikipedia.org/wiki/Lithium-ion_battery

CarUsageType
type: Class
comment: A value indicating a special usage of a car, e.g. commercial rental, driving school, or as a taxi.
subclass of: Enumeration
contributor: Automotive Ontology Working Group
is part of: auto.schema.org

DrivingSchoolVehicleUsage
type: CarUsageType
comment: Indicates the usage of the vehicle for driving school.
contributor: Automotive Ontology Working Group
is part of: auto.schema.org

RentalVehicleUsage
type: CarUsageType
comment: Indicates the usage of the vehicle as a rental car.
contributor: Automotive Ontology Working Group
is part of: auto.schema.org

TaxiVehicleUsage
type: CarUsageType
comment: Indicates the usage of the car as a taxi.
contributor: Automotive Ontology Working Group
is part of: auto.schema.org

accelerationTime
type: Property
comment: The time needed to accelerate the vehicle from a given start velocity to a given target velocity.\n\nTypical unit code(s): SEC for seconds\n\n* Note: There are unfortunately no standard unit codes for seconds/0..100 km/h or seconds/0..60 mph. Simply use "SEC" for seconds and indicate the velocities in the name of the QuantitativeValue, or use valueReference with a QuantitativeValue of 0..60 mph or 0..100 km/h to specify the reference speeds.
contributor: Automotive Ontology Working Group
domain includes: Vehicle
is part of: auto.schema.org
range includes: QuantitativeValue

bodyType
type: Property
comment: Indicates the design and body style of the vehicle (e.g. station wagon, hatchback, etc.).
contributor: Automotive Ontology Working Group
domain includes: Vehicle
is part of: auto.schema.org
range includes: QualitativeValue
range includes: Text
range includes: URL

emissionsCO2
type: Property
comment: The CO2 emissions in g/km. When used in combination with a QuantitativeValue, put "g/km" into the unitText property of that value, since there is no UN/CEFACT Common Code for "g/km".
contributor: Automotive Ontology Working Group
domain includes: Vehicle
is part of: auto.schema.org
range includes: Number

enginePower
type: Property
comment: The power of the vehicle's engine. Typical unit code(s): KWT for kilowatt, BHP for brake horsepower, N12 for metric horsepower (PS, with 1 PS = 735,49875 W)\n\n* Note 1: There are many different ways of measuring an engine's power. For an overview, see [http://en.wikipedia.org/wiki/Horsepower#Engine\_power\_test\_codes](http://en.wikipedia.org/wiki/Horsepower#Engine_power_test_codes).\n* Note 2: You can link to information about how the given value has been determined using the valueReference property.\n* Note 3: You can use minValue and maxValue to indicate ranges.
contributor: Automotive Ontology Working Group
domain includes: EngineSpecification
is part of: auto.schema.org
range includes: QuantitativeValue

engineType
type: Property
comment: The type of engine or engines powering the vehicle.
contributor: Automotive Ontology Working Group
domain includes: EngineSpecification
is part of: auto.schema.org
range includes: QualitativeValue
range includes: Text
range includes: URL

fuelCapacity
type: Property
comment: The capacity of the fuel tank or in the case of electric cars, the battery. If there are multiple components for storage, this should indicate the total of all storage of the same type.\n\nTypical unit code(s): LTR for liters, GLL of US gallons, GLI for UK / imperial gallons, AMH for ampere-hours (for electrical vehicles).
contributor: Automotive Ontology Working Group
domain includes: Vehicle
is part of: auto.schema.org
range includes: QuantitativeValue

modelDate
type: Property
comment: The release date of a vehicle model (often used to differentiate versions of the same make and model).
contributor: Automotive Ontology Working Group
domain includes: Vehicle
is part of: auto.schema.org
range includes: Date

seatingCapacity
type: Property
comment: The number of persons that can be seated (e.g. in a vehicle), both in terms of the physical space available, and in terms of limitations set by law.\n\nTypical unit code(s): C62 for persons.
contributor: Automotive Ontology Working Group
domain includes: Vehicle
is part of: auto.schema.org
range includes: Number
range includes: QuantitativeValue

speed
type: Property
comment: The speed range of the vehicle. If the vehicle is powered by an engine, the upper limit of the speed range (indicated by maxValue) should be the maximum speed achievable under regular conditions.\n\nTypical unit code(s): KMH for km/h, HM for mile per hour (0.447 04 m/s), KNT for knot\n\n*Note 1: Use minValue and maxValue to indicate the range. Typically, the minimal value is zero.\n* Note 2: There are many different ways of measuring the speed range. You can link to information about how the given value has been determined using the valueReference property.
contributor: Automotive Ontology Working Group
domain includes: Vehicle
is part of: auto.schema.org
range includes: QuantitativeValue

torque
type: Property
comment: The torque (turning force) of the vehicle's engine.\n\nTypical unit code(s): NU for newton metre (N m), F17 for pound-force per foot, or F48 for pound-force per inch\n\n* Note 1: You can link to information about how the given value has been determined (e.g. reference RPM) using the valueReference property.\n* Note 2: You can use minValue and maxValue to indicate ranges.
contributor: Automotive Ontology Working Group
domain includes: EngineSpecification
is part of: auto.schema.org
range includes: QuantitativeValue

vehicleSpecialUsage
type: Property
contributor: Automotive Ontology Working Group
is part of: auto.schema.org
range includes: CarUsageType

Battery Domain Ontology
type: Ontology
version IRI: battery
imports: battery-reference
imports: battery-cell-geometry
imports: battery-manufacturing
imports: battery-testing
abstract: The Battery Domain Ontology, a specialized domain within the Elementary Multiperspective Materials Ontology (EMMO), encompasses essential terms and relationships for battery components, cells, interfaces, methods, models, and data. Its primary objective is to enable the creation of linked and FAIR (Findable, Accessible, Interoperable, and Reusable) data, thereby fostering advancements in research and innovation within the realm of batteries. This ontology serves as a foundational resource for harmonizing battery knowledge representation, enhancing data interoperability, and accelerating progress in battery research and development.
bibliographic citation: https://zenodo.org/doi/10.5281/zenodo.7693672
contributor: https://orcid.org/0000-0001-8869-3718
contributor: 0000-0002-1560-809X
contributor: 0000-0002-2547-155X
created: 2022-11-25
creator: https://orcid.org/0000-0002-8758-6109
creator: https://orcid.org/0000-0003-2954-1233
issued: 2025-04-08
license: https://creativecommons.org/licenses/by/4.0/legalcode
modified: 2025-04-08
publisher: EMMO
source: www.electropedia.org
doi: 10.5281/zenodo.7693672
status: unstable
preferred namespace prefix: battery
preferred namespace uri: https://w3id.org/emmo/domain/battery
backward compatible with: 0.18.3-beta
prior version: 0.18.3-beta
version info: 0.18.4-beta

Oxygen
type: Class
alternative label: O2
EMMO 26bf1bef d192 4da6 b0eb d2209698fb54: https://www.wikidata.org/wiki/Q629
EMMO 371f5265 fa29 4081 b722 2c530b1fdddb: https://pubchem.ncbi.nlm.nih.gov/compound/977
EMMO 967080e5 2f42 4eb2 a3a9 c58143e835f9: a chemical substance consisting of the nonmetal oxygen in its elemental form
EMMO b8c10b72 7cc1 4e82 b4ab 728faf504919: O2
EMMO c84c6752 6d64 48cc 9500 e54a3c34898d: https://en.wikipedia.org/wiki/Oxygen
EMMO f652e7d2 0b33 4d10 8d0f 2f70089982ba: molecular oxygen
substance 33ab8162 934b 4e36 bb43 5528d867d6d6: InChI=1S/O2/c1-2

StainlessSteel
type: Class
EMMO 26bf1bef d192 4da6 b0eb d2209698fb54: https://www.wikidata.org/wiki/Q172587
EMMO 967080e5 2f42 4eb2 a3a9 c58143e835f9: an iron-based alloy containing a minimum level of chromium that is resistant to rusting and corrosion
EMMO c84c6752 6d64 48cc 9500 e54a3c34898d: https://en.wikipedia.org/wiki/Stainless_steel

Silicon
type: Class
alternative label: Si
EMMO 26bf1bef d192 4da6 b0eb d2209698fb54: https://www.wikidata.org/wiki/Q670
EMMO 371f5265 fa29 4081 b722 2c530b1fdddb: https://pubchem.ncbi.nlm.nih.gov/compound/5461123
EMMO 967080e5 2f42 4eb2 a3a9 c58143e835f9: a chemical substance consisting of the metalloid silicon in its elemental form
EMMO b8c10b72 7cc1 4e82 b4ab 728faf504919: Si
EMMO c84c6752 6d64 48cc 9500 e54a3c34898d: https://en.wikipedia.org/wiki/Silicon
EMMO f652e7d2 0b33 4d10 8d0f 2f70089982ba: silicon
substance 33ab8162 934b 4e36 bb43 5528d867d6d6: InChI=1S/Si

CarbonElementalSubstance
type: Class
EMMO 967080e5 2f42 4eb2 a3a9 c58143e835f9: a chemical substance consisting of elemental carbon in its various allotropic forms

CopperIIPerchlorate
type: Class
alternative label: Cu(ClO4)2
EMMO 26bf1bef d192 4da6 b0eb d2209698fb54: https://www.wikidata.org/wiki/Q15628157
EMMO 371f5265 fa29 4081 b722 2c530b1fdddb: https://pubchem.ncbi.nlm.nih.gov/compound/28211
EMMO 967080e5 2f42 4eb2 a3a9 c58143e835f9: a chemical compound consisting of copper in the +2 oxidation state bonded to perchlorate anions
EMMO b8c10b72 7cc1 4e82 b4ab 728faf504919: Cl2CuO8
EMMO c84c6752 6d64 48cc 9500 e54a3c34898d: https://en.wikipedia.org/wiki/Copper(II)_perchlorate
EMMO f652e7d2 0b33 4d10 8d0f 2f70089982ba: copper;diperchlorate
substance 33ab8162 934b 4e36 bb43 5528d867d6d6: InChI=1S/2ClHO4.Cu/c2*2-1(3,4)5;/h2*(H,2,3,4,5);/q;;+2/p-2

Helium
type: Class
alternative label: He
EMMO 26bf1bef d192 4da6 b0eb d2209698fb54: https://www.wikidata.org/wiki/Q560
EMMO 371f5265 fa29 4081 b722 2c530b1fdddb: https://pubchem.ncbi.nlm.nih.gov/compound/23987
EMMO 967080e5 2f42 4eb2 a3a9 c58143e835f9: a chemical substance consisting of the noble gas helium in its elemental form
EMMO b8c10b72 7cc1 4e82 b4ab 728faf504919: He
EMMO c84c6752 6d64 48cc 9500 e54a3c34898d: https://en.wikipedia.org/wiki/Helium
EMMO f652e7d2 0b33 4d10 8d0f 2f70089982ba: helium
substance 33ab8162 934b 4e36 bb43 5528d867d6d6: InChI=1S/He

Iron
type: Class
EMMO 26bf1bef d192 4da6 b0eb d2209698fb54: https://www.wikidata.org/wiki/Q677
EMMO 371f5265 fa29 4081 b722 2c530b1fdddb: https://pubchem.ncbi.nlm.nih.gov/compound/23925
EMMO 967080e5 2f42 4eb2 a3a9 c58143e835f9: a chemical substance consisting of the transition metal iron in its elemental form
EMMO b8c10b72 7cc1 4e82 b4ab 728faf504919: Fe
EMMO c84c6752 6d64 48cc 9500 e54a3c34898d: https://en.wikipedia.org/wiki/Iron
EMMO f652e7d2 0b33 4d10 8d0f 2f70089982ba: iron
substance 33ab8162 934b 4e36 bb43 5528d867d6d6: InChI=1S/Fe

Aluminium
type: Class
EMMO 26bf1bef d192 4da6 b0eb d2209698fb54: https://www.wikidata.org/wiki/Q663
EMMO 371f5265 fa29 4081 b722 2c530b1fdddb: https://pubchem.ncbi.nlm.nih.gov/compound/5359268
EMMO 967080e5 2f42 4eb2 a3a9 c58143e835f9: a chemical substance consisting of the metal aluminium in its elemental form
EMMO b8c10b72 7cc1 4e82 b4ab 728faf504919: Al
EMMO c84c6752 6d64 48cc 9500 e54a3c34898d: https://en.wikipedia.org/wiki/Aluminium
EMMO f652e7d2 0b33 4d10 8d0f 2f70089982ba: aluminum
substance 33ab8162 934b 4e36 bb43 5528d867d6d6: InChI=1S/Al

Zinc
type: Class
EMMO 26bf1bef d192 4da6 b0eb d2209698fb54: https://www.wikidata.org/wiki/Q758
EMMO 371f5265 fa29 4081 b722 2c530b1fdddb: https://pubchem.ncbi.nlm.nih.gov/compound/23994
EMMO 967080e5 2f42 4eb2 a3a9 c58143e835f9: a chemical substance consisting of the transition metal zinc in its elemental form
EMMO b8c10b72 7cc1 4e82 b4ab 728faf504919: Zn
EMMO c84c6752 6d64 48cc 9500 e54a3c34898d: https://en.wikipedia.org/wiki/Zinc
EMMO f652e7d2 0b33 4d10 8d0f 2f70089982ba: zinc
substance 33ab8162 934b 4e36 bb43 5528d867d6d6: InChI=1S/Zn
preferred label: Graphene
EMMO 26bf1bef d192 4da6 b0eb d2209698fb54: https://www.wikidata.org/wiki/Q169917
EMMO 371f5265 fa29 4081 b722 2c530b1fdddb: https://pubchem.ncbi.nlm.nih.gov/compound/5462310
EMMO 967080e5 2f42 4eb2 a3a9 c58143e835f9: a chemical substance consisting of a single layer of carbon atoms arranged in a two-dimensional honeycomb lattice
EMMO b8c10b72 7cc1 4e82 b4ab 728faf504919: C
EMMO c84c6752 6d64 48cc 9500 e54a3c34898d: https://en.wikipedia.org/wiki/Graphene
EMMO f652e7d2 0b33 4d10 8d0f 2f70089982ba: carbon
substance 33ab8162 934b 4e36 bb43 5528d867d6d6: InChI=1S/C

Lithium
type: Class
alternative label: Li
EMMO 26bf1bef d192 4da6 b0eb d2209698fb54: https://www.wikidata.org/wiki/Q568
EMMO 371f5265 fa29 4081 b722 2c530b1fdddb: https://pubchem.ncbi.nlm.nih.gov/compound/3028194
EMMO 967080e5 2f42 4eb2 a3a9 c58143e835f9: a chemical substance consisting of the alkali metal lithium in its elemental form
EMMO b8c10b72 7cc1 4e82 b4ab 728faf504919: Li
EMMO c84c6752 6d64 48cc 9500 e54a3c34898d: https://en.wikipedia.org/wiki/Lithium
EMMO f652e7d2 0b33 4d10 8d0f 2f70089982ba: lithium
substance 33ab8162 934b 4e36 bb43 5528d867d6d6: InChI=1S/Li

Ion
type: Class
EMMO 26bf1bef d192 4da6 b0eb d2209698fb54: https://www.wikidata.org/wiki/Q36496
EMMO 967080e5 2f42 4eb2 a3a9 c58143e835f9: an atom or molecule with a net electrical charge
EMMO c84c6752 6d64 48cc 9500 e54a3c34898d: https://en.wikipedia.org/wiki/Ion

SiliconDioxide
type: Class
alternative label: SiO2
alternative label: Silica
EMMO 26bf1bef d192 4da6 b0eb d2209698fb54: https://www.wikidata.org/wiki/Q116269
EMMO 371f5265 fa29 4081 b722 2c530b1fdddb: https://pubchem.ncbi.nlm.nih.gov/compound/24261
EMMO 967080e5 2f42 4eb2 a3a9 c58143e835f9: a chemical compound consisting of silicon and two oxygen atoms
EMMO b8c10b72 7cc1 4e82 b4ab 728faf504919: SiO2
EMMO c84c6752 6d64 48cc 9500 e54a3c34898d: https://en.wikipedia.org/wiki/Silicon_dioxide
EMMO f652e7d2 0b33 4d10 8d0f 2f70089982ba: dioxosilane
substance 33ab8162 934b 4e36 bb43 5528d867d6d6: InChI=1S/O2Si/c1-3-2
substance 7fd07cf9 9736 48be 963c f924ada8ac46: O=[Si]=O

electron
type: Class
subclass of: CHEBI_36338

proton
type: Class
subclass of: CHEBI_15378
subclass of: CHEBI_33253

copper atom
type: Class
subclass of: CHEBI_33366
subclass of: CHEBI_88184

copper(0)
type: Class
subclass of: CHEBI_37404

photon
type: Class
subclass of: CHEBI_36341

probe
type: Class
subclass of: CHEBI_33232

carbon monoxide(1+)
type: Class
subclass of: CHEBI_25697

high pressure environment
type: Class
IAO_0000115: A high pressure environment is an environment in which all material entities are exposed to a high ratio of force per unit area.
subclass of: Restriction
  on property: RO_0000086
  some values from: PATO_0001576
subclass of: ENVO_01000997
equivalent class: Class
  intersection of: ENVO_01000997
  intersection of: Restriction
    on property: RO_0000086
    some values from: PATO_0001576

domestic garden
type: Class
IAO_0000115: A garden that is associated with a human house. This association is generally one of spatial proximity or parthood.
subclass of: ENVO_00000011

bathroom
type: Class
IAO_0000115: A bathroom is a room which contains a washbasin or other fixture, such as a shower or bath, used for bathing by humans.
created by: ORCID:0000-0002-4366-3088
has exact synonym: bathing room
has related synonym: toilet
has related synonym: washroom
subclass of: ENVO_01000426

water truck
type: Class
IAO_0000115: A water truck is a truck which transports water.
subclass of: ENVO_01000602

motor boat
type: Class
IAO_0000115: A motor boat is a boat which is propelled by a motor.
has exact synonym: motorised boat
has exact synonym: motorized boat
subclass of: ENVO_01000601
subclass of: ENVO_01000608

carbon dioxide emission
type: Class
IAO_0000115: A volume of carbon dioxide gas emitted by a carbon dioxide emission process.
comment: This is a working definition for #280. Which processes will ultimately be included in the axioms is still open.
subclass of: Restriction
  on property: RO_0002353
  some values from: carbon dioxide emission process
subclass of: ENVO_01000451

public building
type: Class
IAO_0000115: A building which is publically accessible.
IAO_0000116: Created for SDGIO, we treat "public" as "publically accessible" where the semantics of access are dealt with in SDGIO.
subclass of: Restriction
  on property: BFO_0000050
  some values from: ENVO_01000779
subclass of: ENVO_00000073

slightly saline water
type: Class
IAO_0000115: Water which contains a slightly increased concentration of dissolved salts, relative to their concentration in freshwater.
has db xref: EcoLexicon:saltwater
has db xref: SWEETRealm:SalineWater
has db xref: SWEETRealm:SaltWater
has db xref: https://en.wikipedia.org/wiki/Saline_water
has exact synonym: slightly salty water
in subset: ENVO_03605019
comment: The United States Geological Survey classifies slightly saline water as having around 1,000 to 3,000 ppm (0.1–0.3%) of dissolved salts.
subclass of: ENVO_00002010

moderately saline water
type: Class
IAO_0000115: Water which contains a moderately increased concentration of dissolved salts, relative to their concentration in freshwater.
has db xref: EcoLexicon:saltwater
has db xref: SWEETRealm:SalineWater
has db xref: SWEETRealm:SaltWater
has db xref: https://en.wikipedia.org/wiki/Saline_water
has exact synonym: moderately salty water
in subset: ENVO_03605019
comment: The United States Geological Survey classifies moderately saline water as having around 3,000 to 10,000 ppm (0.3–1%) of dissolved salts.
subclass of: ENVO_00002010

highly saline water
type: Class
IAO_0000115: Water which contains a highly increased concentration of dissolved salts, relative to their concentration in freshwater.
has db xref: EcoLexicon:saltwater
has db xref: SWEETRealm:SalineWater
has db xref: SWEETRealm:SaltWater
has db xref: https://en.wikipedia.org/wiki/Saline_water
has exact synonym: highly salty water
in subset: ENVO_03605019
comment: The United States Geological Survey classifies highly saline water as having around 10,000 to 35,000 ppm (1–3.5%) of dissolved salts.
subclass of: ENVO_00002010

concentration of carbon dioxide in an atmosphere
type: Class
IAO_0000115: The concentration of carbon dioxide when measured in air that is part of an atmosphere.
creator: https://orcid.org/0000-0002-4366-3088
date: 2020-05-19T22:51:38+00:00
in subset: envoAtmo
in subset: envoNceas
subclass of: Restriction
  on property: RO_0000052
  some values from: Class
    intersection of: CHEBI_16526
    intersection of: Restriction
      on property: BFO_0000050
      some values from: ENVO_01000267
subclass of: PATO_0000033
equivalent class: Class
  intersection of: PATO_0000033
  intersection of: Restriction
    on property: RO_0000052
    some values from: Class
      intersection of: CHEBI_16526
      intersection of: Restriction
        on property: BFO_0000050
        some values from: ENVO_01000267

rainy day
type: Class
IAO_0000115: A day during which water-based rainfall occurs.
creator: https://orcid.org/0000-0002-4366-3088
comment: The threshold of precipitation at which humans consider a day 'rainy' is aribitrary.
subclass of: Restriction
  on property: RO_0002088
  some values from: ENVO_01000830
subclass of: day

area of high atmospheric pressure
type: Class
IAO_0000115: A gaseous part of an atmosphere in which gases have increased atmospheric pressure.
comment: Air is not specified directly (although the definition subsumes air masses) to allow for other forms of low pressure areas in planetary atmospheres.
subclass of: Restriction
  on property: RO_0002473
  some values from: Class
    intersection of: ENVO_01000797
    intersection of: Restriction
      on property: RO_0000086
      some values from: PATO_0001576
subclass of: ENVO_01001645

air pollution
type: Class
IAO_0000115: A pollution process during which particulates or other contaminants are released into a portion of air.
in subset: environmental hazards
in subset: envoPolar
subclass of: Restriction
  on property: RO_0002234
  some values from: Class
    intersection of: ENVO_01000254
    intersection of: Restriction
      on property: BFO_0000051
      some values from: contaminated air
subclass of: Restriction
  on property: RO_0002233
  some values from: Class
    intersection of: ENVO_01000254
    intersection of: Restriction
      on property: BFO_0000051
      some values from: ENVO_00002005
subclass of: Restriction
  on property: BFO_0000066
  some values from: ENVO_00002005
subclass of: ENVO_02500036
equivalent class: Class
  intersection of: ENVO_02500036
  intersection of: Restriction
    on property: BFO_0000066
    some values from: ENVO_00002005

pollution monitoring
type: Class
IAO_0000115: A monitoring process that assays the level of environmental pollutants to determine the presence of effect of environmental pollution.
in subset: envoPolar
subclass of: Restriction
  on property: RO_0002427
  some values from: ENVO_02500036
subclass of: ENVO_02500041
equivalent class: Class
  intersection of: ENVO_02500041
  intersection of: Restriction
    on property: RO_0002427
    some values from: ENVO_02500036

urban pollution
type: Class
IAO_0000115: A pollution process that results in increased levels of pollutants in an urban environment.
in subset: environmental hazards
subclass of: Restriction
  on property: RO_0002234
  some values from: Class
    intersection of: ENVO_01000249
    intersection of: Restriction
      on property: BFO_0000051
      some values from: Class
        intersection of: ENVO_00010483
        intersection of: Restriction
subclass of: Restriction
  on property: BFO_0000066
  some values from: ENVO_01000249
subclass of: Restriction
  on property: RO_0002233
  some values from: ENVO_01000249
subclass of: ENVO_02500036
equivalent class: Class
  intersection of: ENVO_02500036
  intersection of: Restriction
    on property: BFO_0000066
    some values from: ENVO_01000249

educational facility
type: Class
IAO_0000115: A facility in which people are educated.
created by: https://orcid.org/0000-0002-9578-0788
creation date: 2021-03-15T04:00:01.750000+00:00
subclass of: ENVO_03501288

university building
type: Class
IAO_0000115: An institutional building in which university services are performed.
created by: https://orcid.org/0000-0002-9578-0788
creation date: 2021-03-15T04:00:01.750000+00:00
has exact synonym: campus building
has exact synonym: university college building
subclass of: Restriction
  on property: BFO_0000050
  some values from: ENVO_00000467
subclass of: ENVO_03501197

residential environment
type: Class
IAO_0000115: An anthropogenic environment which provides long-term shelter for its inhabitants.
created by: https://orcid.org/0000-0002-9578-0788
creation date: 2021-03-15T04:00:01.750000+00:00
subclass of: Restriction
  on property: BFO_0000051
  some values from: ENVO_01000933
subclass of: ENVO_01000313

occupational environment
type: Class
IAO_0000115: An anthropogenic environment which is the product of a particular human occupational acitivity.
created by: https://orcid.org/0000-0002-9578-0788
creation date: 2021-03-15T04:00:01.750000+00:00
has exact synonym: work environment
subclass of: ENVO_01000313

household environment
type: Class
IAO_0000115: An anthropogenic environment which is bounded by a human dwelling.
created by: https://orcid.org/0000-0002-9578-0788
creation date: 2021-03-15T04:00:01.750000+00:00
subclass of: Restriction
  on property: BFO_0000051
  some values from: ENVO_01000744
subclass of: ENVO_01000313

emissions from petroleum combustion
type: Class
IAO_0000115: An environmental material which is composed primarily of gases and particles produced by the combustion of petroleum fuels.
created by: https://orcid.org/0000-0002-3410-4655
created by: https://orcid.org/0000-0002-7356-1779
created by: https://orcid.org/0000-0002-7463-6306
creation date: 2021-02-12T15:10:14.018000+00:00
subclass of: Restriction
  on property: RO_0001000
  some values from: ENVO_00002984
subclass of: Restriction
  on property: RO_0002353
  some values from: ENVO_01000839
subclass of: ENVO_00010483

concentration of carbon dioxide in air
type: Class
IAO_0000115: The concentration of carbon dioxide when measured in air.
creator: https://orcid.org/0000-0003-1264-1166
date: 2019-03-14T21:24:04+00:00
in subset: envoNceas
subclass of: Restriction
  on property: RO_0000052
  some values from: Class
    intersection of: CHEBI_16526
    intersection of: Restriction
      on property: BFO_0000050
      some values from: ENVO_00002005
subclass of: PATO_0000033
equivalent class: Class
  intersection of: PATO_0000033
  intersection of: Restriction
    on property: RO_0000052
    some values from: Class
      intersection of: CHEBI_16526
      intersection of: Restriction
        on property: BFO_0000050
        some values from: ENVO_00002005

rainy day count
type: Class
IAO_0000115: The number of days during which there is precipitation
creator: https://orcid.org/0000-0001-6284-4821
date: 2021-12-13T02:42:11+00:00
comment: The threshold at which a day is considered to be a rainy day is highly variable, and determined at the instance level.
subclass of: Restriction
  on property: RO_0000052
  some values from: BFO_0000038
subclass of: PATO_0000070

concentration of pesticide in surface water
type: Class
IAO_0000115: The concentration of a pesticide when measured in surface water.
has exact synonym: surface water pesticide concentration
subclass of: Restriction
  on property: RO_0000052
  some values from: Class
    intersection of: CHEBI_25944
    intersection of: Restriction
      on property: BFO_0000050
      some values from: ENVO_00002042
subclass of: PATO_0000033
equivalent class: Class
  intersection of: PATO_0000033
  intersection of: Restriction
    on property: RO_0000052
    some values from: Class
      intersection of: CHEBI_25944
      intersection of: Restriction
        on property: BFO_0000050
        some values from: ENVO_00002042

atmospheric wind intensity
type: Class
IAO_0000115: The intensity of a atmospheric wind.
has exact synonym: intensity of atmospheric wind
subclass of: Restriction
  on property: RO_0000052
  some values from: ENVO_01000793
subclass of: PATO_0000049
equivalent class: Class
  intersection of: PATO_0000049
  intersection of: Restriction
    on property: RO_0000052
    some values from: ENVO_01000793

pressure of air
type: Class
IAO_0000115: The pressure of some air.
has exact synonym: air pressure
subclass of: Restriction
  on property: RO_0000052
  some values from: ENVO_00002005
subclass of: PATO_0001025
equivalent class: Class
  intersection of: PATO_0001025
  intersection of: Restriction
    on property: RO_0000052
    some values from: ENVO_00002005

volume of rain
type: Class
IAO_0000115: The volume of some rain.
has exact synonym: rain volume
subclass of: Restriction
  on property: RO_0000052
  some values from: ENVO_01001564
subclass of: PATO_0000918
equivalent class: Class
  intersection of: PATO_0000918
  intersection of: Restriction
    on property: RO_0000052
    some values from: ENVO_01001564

amplitude of temperature of air
type: Class
IAO_0000115: The amplitude of some temperature of air.
has exact synonym: temperature of air amplitude
subclass of: Restriction
  on property: RO_0000052
  some values from: ENVO_09200001
subclass of: PATO_0000080
equivalent class: Class
  intersection of: PATO_0000080
  intersection of: Restriction
    on property: RO_0000052
    some values from: ENVO_09200001

hours of sunshine
type: Class
IAO_0000115: A one-dimensional temporal region during which an entity is exposed to stellar radiation.
has exact synonym: sunshine hours
in subset: envoCryo
in subset: envoPolar
subclass of: BFO_0000038

electric energy
type: Class
IAO_0000115: potential energy due to or stored in electric fields.
created by: https://orcid.org/0000-0002-6601-2165
creation date: 2018-11-03T20:27:07+00:00
subclass of: ENVO_2000016

time stamped measurement datum
type: Class
subclass of: IAO_0000109

time sampled measurement data set
type: Class
IAO_0000115: A data set that is an aggregate of data recording some measurement at a number of time points. The time series data set is an ordered list of pairs of time measurement data and the corresponding measurement data acquired at that time.
subclass of: IAO_0000100

container
type: Class
IAO_0000115: A device that can be used to restrict the location of material entities over time
subclass of: OBI_0000968

increased speed
type: Class
IAO_0000115: A speed which is relatively high.
has exact synonym: high speed
has related synonym: fast speed
subclass of: PATO_0000008
subclass of: PATO_0002305

decreased speed
type: Class
IAO_0000115: A speed which is relatively low.
has exact synonym: slow
has exact synonym: slow speed
subclass of: PATO_0000008
subclass of: PATO_0002303

down
type: Class
IAO_0000115: A directional quality inhering in a bearer by virtue of the bearer's direction from a higher to a lower point.
subclass of: PATO_0000039

left
type: Class
IAO_0000115: A directional quality inhering in a bearer by virtue of the bearer's direction that is similar to the direction of an object to the north when it faces east.
subclass of: PATO_0000039

right
type: Class
IAO_0000115: A directional quality inhering in a bearer by virtue of the bearer's direction that is similar to the direction of an object to the north when it faces west.
subclass of: PATO_0000039

up
type: Class
IAO_0000115: A directional quality inhering in a bearer by virtue of the bearer's direction from a lower to a higher point.
subclass of: PATO_0000039

increased frequency
type: Class
IAO_0000115: A frequency which is relatively high.
has exact synonym: high frequency
has related synonym: frequent
subclass of: PATO_0000044
subclass of: PATO_0055003

decreased frequency
type: Class
IAO_0000115: A frequency which is relatively low.
has exact synonym: low frequency
has related synonym: infrequent
subclass of: PATO_0000044
subclass of: PATO_0055004

increased volume
type: Class
IAO_0000115: A volume which is relatively high.
has exact synonym: high volume
has related synonym: large volume
subclass of: PATO_0000586
subclass of: PATO_0000918

decreased volume
type: Class
IAO_0000115: A volume which is relatively low.
has exact synonym: low volume
has related synonym: small volume
subclass of: PATO_0000587
subclass of: PATO_0000918

decreased width
type: Class
IAO_0000115: A width which is relatively small.
has related synonym: narrow
subclass of: PATO_0000587
subclass of: PATO_0000921

increased width
type: Class
IAO_0000115: A width which is relatively large.
has related synonym: broad
has related synonym: wide
has related synonym: wide/broad
subclass of: PATO_0000586
subclass of: PATO_0000921

acceleration
type: Class
IAO_0000115: A physical quality inhering in a bearer by virtue of the rate of change of the bearer's velocity in either speed or direction.
subclass of: PATO_0001906

magnetic
type: Class
IAO_0000115: A magnetic quality inhering in a bearer by virtue of the bearer's ability to exert magnitism.
subclass of: PATO_0001682

decreased wetness
type: Class
IAO_0000115: A wetness quality that is relatively low.
has exact synonym: low wetness
subclass of: PATO_0001823
subclass of: PATO_0002303

decreased fluid flow
type: Class
IAO_0000115: A flow that is relatively low.
has exact synonym: low flow
subclass of: PATO_0002243
subclass of: PATO_0002303

increased fluid flow
type: Class
IAO_0000115: A fluid flow that is relatively high.
has exact synonym: high flow
subclass of: PATO_0002243
subclass of: PATO_0002305

increased velocity
type: Class
IAO_0000115: A physical quality inhering in a bearer by virtue of the bearer's increased rate of change of the position.
subclass of: PATO_0002242
subclass of: PATO_0002305

decreased velocity
type: Class
IAO_0000115: A physical quality inhering in a bearer by virtue of the bearer's decreased rate of change of the position.
subclass of: PATO_0002242
subclass of: PATO_0002303

decreased humidity
type: Class
IAO_0000115: An decrease in humidity.
subclass of: PATO_0002303
subclass of: PATO_0015009

normal pressure
type: Class
IAO_0000115: A pressure which is relatively normal or average
subclass of: PATO_0001025
subclass of: PATO_0045001

normal velocity
type: Class
IAO_0000115: A velocity which is relatively normal or average
subclass of: PATO_0002242
subclass of: PATO_0045001

greenhouse gas
type: Class
in subset: envoPolar
subclass of: CHEBI_51086

high temperature environment
type: Class
IAO_0000115: A high temperature environment is an environment in which material entities are exposed to increased levels of heat radiation or which have molecules or atoms moving randomly with increased levels of average kinietic energy.
subclass of: Restriction
  on property: RO_0000086
  some values from: PATO_0001305
subclass of: ENVO_01000997
equivalent class: Class
  intersection of: ENVO_01000997
  intersection of: Restriction
    on property: RO_0000086
    some values from: PATO_0001305

indoor kitchen
type: Class
IAO_0000115: An indoor kitchen is a room or part of a room primarily used for cooking or food preparation, but which may have other funcitons such as dining, food storage, dishwashing, or laundry.
created by: ORCID:0000-0002-4366-3088
comment: Not a sublcass of room as this may just be part of some room.
subclass of: ENVO_01000420

living room
type: Class
IAO_0000115: A living room is a room in a human house which is used for social and domestic leisure activities.
created by: ORCID:0000-0002-4366-3088
has exact synonym: living-room
comment: The logical definitions must state which social and leisure activities are included here. Jet-skiing and mass rallies are probably not the range.
subclass of: ENVO_01000426

patio
type: Class
IAO_0000115: A patio is a paved outdoor area, adjacent to a human house, and used for dining or recreation.
subclass of: Restriction
  on property: RO_0002220
  some values from: ENVO_01000418
subclass of: ENVO_00000070

fence
type: Class
IAO_0000115: A fence is a constructed barrier which is generally of lighter construction than a wall and used to provide visual sectioning of spaces.
created by: ORCID:0000-0002-4366-3088
subclass of: ENVO_01000467

ceiling
type: Class
created by: ORCID:0000-0002-4366-3088
has related synonym: A ceiling is an overhead interior surface that covers the upper limit of a room. It is not generally considered a structural element, but a finished surface concealing the underside of the floor or roof structure above.
subclass of: Restriction
  on property: BFO_0000050
  some values from: ENVO_01000426
subclass of: ENVO_01000420

atmospheric ozone
type: Class
IAO_0000115: Atmospheric ozone is an environmental material primarily composed of ozone in its gaseous form and present in an atmosphere.
created by: ORCID:0000-0002-4366-3088
has related synonym: atmospheric ozone
subclass of: Restriction
  on property: RO_0002473
  some values from: CHEBI_25812
subclass of: Restriction
  on property: BFO_0000050
  some values from: ENVO_01000267
subclass of: ENVO_01000797

electric lamp
type: Class
IAO_0000115: An electric lamp is a lamp which produces light from electricity.
subclass of: ENVO_01000566

radio device
type: Class
IAO_0000115: A device capable of receiving and/or transmitting information encoded in electromagnetic radiation through wave modulation.
has broad synonym: radio
has narrow synonym: radio receiver
has narrow synonym: radio transmitter
subclass of: ENVO_00003074

television set
type: Class
IAO_0000115: A television set is a device that combines a tuner, display, and loudspeakers for the purpose of converting digital or analog information signals into moving images and sound.
has broad synonym: television
has exact synonym: TV
has exact synonym: telly
has exact synonym: tube
subclass of: ENVO_00003074

mobile phone
type: Class
IAO_0000115: A mobile phone is a telephone which transmits sound information to a mobile phone network via radio transmissions.
has exact synonym: cell phone
has exact synonym: cellular phone
has exact synonym: hand phone
subclass of: ENVO_01000580

landline telephone
type: Class
IAO_0000115: A landline telephone is a telephone which is connected to a telephone network with wires through which electronic signals are carried.
subclass of: ENVO_01000580

refrigerator
type: Class
IAO_0000115: A refrigerator is a device which consists of a thermally insulated compartment and a mechanical, chemical, or electronic heat pump that transfers heat from the inside of the fridge to its external environment such that the inside of the fridge is cooled to a temperature below the ambient temperature of the room
has exact synonym: fridge
subclass of: Restriction
  on property: BFO_0000051
  some values from: Restriction
    on property: RO_0001015
    some values from: CHEBI_78433
subclass of: ENVO_00003074

desk
type: Class
IAO_0000115: A desk is a table which is intended for information-manipulation tasks, including writing and use of interactive electronics.
comment: The intentional nature of this definition is problematic, but the restricted range of activities visited upon a desk is of interest.
subclass of: ENVO_01000584

sofa
type: Class
IAO_0000115: A sofa is a bench which is partially or entirely upholstered, and often fitted with springs and tailored cushions.
has exact synonym: couch
has exact synonym: settee
subclass of: ENVO_01000589

contaminated air
type: Class
IAO_0000115: Contaminated air is air which has sufficient concentrations of environmental pollutants such that it may adversely affect a given ecosystem.
subclass of: Restriction
  on property: ENVO_02000200
  some values from: Class
    intersection of: CHEBI_24431
    intersection of: Restriction
      on property: RO_0000087
      some values from: CHEBI_78298
subclass of: ENVO_00002005
equivalent class: Class
  intersection of: ENVO_00002005
  intersection of: Restriction
    on property: ENVO_02000200
    some values from: Class
      intersection of: CHEBI_24431
      intersection of: Restriction
        on property: RO_0000087
        some values from: CHEBI_78298

carbon dioxide emission process
type: Class
IAO_0000115: A carbon emission process is any environmental process which releases carbon dioxide gas into the atmosphere.
in subset: envoPolar
comment: Requested for SDGIO. This class may be revised in future once the offical definitions become more clear.
subclass of: Restriction
  on property: RO_0002418
  some values from: ENVO_02500004
subclass of: Restriction
  on property: RO_0002234
  some values from: Class
    intersection of: CHEBI_16526
    intersection of: Restriction
      on property: RO_0000086
      some values from: PATO_0001547
subclass of: ENVO_01000742

humid air
type: Class
IAO_0000115: Air which has increased levels of water vapour.
subclass of: Restriction
  on property: ENVO_02000200
  some values from: ENVO_01000266
subclass of: Restriction
  on property: RO_0000086
  some values from: PATO_0015010
subclass of: ENVO_00002005

water raindrop
type: Class
has broad synonym: raindrop
comment: This is the class intended for use when describing raindrops on Earth. These typically have a diamter of 0.1 to 9 millimetres.
subclass of: ENVO_01000832
subclass of: ENVO_01000833

atmospheric weather
type: Class
IAO_0000115: Weather which inheres in an atmosphere.
comment: This class refers to the common usage of "weather", referencing the state of a (part of) an astronomical body's atmosphere.
subclass of: Restriction
  on property: RO_0000052
  some values from: ENVO_01000267
subclass of: ENVO_01001078

radio wave stellar radiation
type: Class
IAO_0000114: IAO_0000428
IAO_0000115: A stellar radiation process during which electromagnetic waves or their quanta are emitted from a star at wavelengths ranging from millimetre to kilometer scales.
has narrow synonym: radio wave solar radiation
has OBO namespace: ENVO
in subset: envoAstro
comment: As with microwaves, considerable variation exists in the delimitation of frequency and wavelength thresholds for radiowaves. The ISO 21348 standard allows a wavelength range of 0.10 mm to 100 m and a frequency range of 300 GHz to 3 MHz. However, much lower thresholds also exist.
subclass of: ENVO_01001211
subclass of: ENVO_21001213
equivalent class: Class
  intersection of: ENVO_21001213
  intersection of: Restriction
    on property: RO_0002608
    some values from: ENVO_01000801

infrared stellar radiation
type: Class
IAO_0000115: A stellar radiation process during which electromagnetic waves or their quanta are emitted from a star when molecules change their rotational-vibrational movements, usually at wavelengths between 760 nm and 1 mm.
has broad synonym: infrared radiation
has exact synonym: infra-red stellar radiation
has narrow synonym: infrared solar radiation
has related synonym: IR stellar radiation
in subset: envoAstro
subclass of: ENVO_01001211
subclass of: ENVO_21001214
equivalent class: Class
  intersection of: ENVO_21001214
  intersection of: Restriction
    on property: RO_0002608
    some values from: ENVO_01000801

visible spectrum stellar radiation
type: Class
IAO_0000115: A stellar radiation process during which electromagnetic waves or their quanta are emitted from a star at wavelengths between 380 nm and 760 nm.
has exact synonym: optical stellar radiation
has narrow synonym: visible spectrum solar radiation
has OBO namespace: ENVO
in subset: envoAstro
subclass of: ENVO_01001211
subclass of: ENVO_21001215
equivalent class: Class
  intersection of: ENVO_21001215
  intersection of: Restriction
    on property: RO_0002608
    some values from: ENVO_01000801

ultraviolet stellar radiation
type: Class
IAO_0000115: A stellar radiation process during which electromagnetic waves or their quanta are emitted from a star at wavelengths between 10 nm and 400 nm.
IAO_0000116: To be expanded to account for subtypes.
has db xref: NCIT:C17231
has narrow synonym: ultraviolet solar radiation
has OBO namespace: ENVO
in subset: environmental hazards
in subset: envoAstro
subclass of: ENVO_01001211
subclass of: ENVO_21001216
equivalent class: Class
  intersection of: ENVO_21001216
  intersection of: Restriction
    on property: RO_0002608
    some values from: ENVO_01000801

laboratory environment
type: Class
IAO_0000115: An anthropogenic environment which is bounded by the building envelope of a laboratory and in which a system of manufactured products exert control on one or more of its environmental conditions.
created by: https://orcid.org/0000-0002-4366-3088
subclass of: ENVO_01000313

laboratory facility
type: Class
IAO_0000115: A research facility in which systems of manufactured products control internal conditions and in which scientific or technological research, experiments, and measurement may be performed.
created by: https://orcid.org/0000-0002-4366-3088
created by: https://orcid.org/0000-0002-9578-0788
has exact synonym: research laboratory
in subset: ENVO_03605023
subclass of: Restriction
  on property: BFO_0000051
  some values from: laboratory environment
subclass of: ENVO_00000469

anthropogenic light pollution
type: Class
IAO_0000115: A pollution process during which artificial light with wavelengths in the visible spectrum is released into the environment.
created by: https://orcid.org/0000-0002-4366-3088
creation date: 2019-01-09T09:05:35+00:00
has exact synonym: Lichtverschmutzung @de
comment: This form of pollution is typically the result of urbanisation or similar land use change.
subclass of: Restriction
  on property: BFO_0000051
  some values from: ENVO_01001502
subclass of: ENVO_02500027
subclass of: ENVO_02500036

agricultural pollution
type: Class
IAO_0000115: An environmental pollution process during which contaminants derived from agricultural activity are released into an environmental system.
creator: https://orcid.org/0000-0002-4366-3088
creation date: 2019-05-29T08:01:44+00:00
has exact synonym: Verschumutzung durch Landwirtschaft @de
comment: Examples include the release of pesticies and/or antibiotic-laden animal waste into water bodies.
subclass of: Restriction
  on property: BFO_0000066
  some values from: Class
    union of: ENVO_01000245
    union of: ENVO_01000247
subclass of: ENVO_02500036

water-holding capacity
type: Class
IAO_0000115: A disposition of a material entity which is realised when it is saturated with liquid water.
creator: https://orcid.org/0000-0002-4366-3088
subclass of: Restriction
  on property: RO_0000052
  some values from: BFO_0000040
subclass of: BFO_0000016

day
type: Class
IAO_0000115: A one-dimensional temporal region which spans the duration an astronomical body completes one rotation on its axis.
creator: https://orcid.org/0000-0002-4366-3088
subclass of: BFO_0000038

electromagnetic wave energy
type: Class
IAO_0000115: Wave energy which inheres in perpendicular electric and magnetic fields and which is realised when they oscillate and propagate.
creator: https://orcid.org/0000-0002-4366-3088
has related synonym: electromagnetic radiant energy
subclass of: Restriction
  on property: BFO_0000054
  some values from: ENVO_01001026
subclass of: ENVO_01003019

pollution degradation
type: Class
contributor: https://orcid.org/0000-0002-6601-2165
created: 2024-08-05T21:20:56+00:00
subclass of: Restriction
  on property: BFO_0000051
  some values from: ENVO_06105014
subclass of: ENVO_02000178
equivalent class: Class
  intersection of: ENVO_02000178
  intersection of: Restriction
    on property: BFO_0000051
    some values from: ENVO_06105014

water pollution
type: Class
IAO_0000115: A pollution process during which contaminants are released into water.
in subset: environmental hazards
in subset: envoPolar
subclass of: Restriction
  on property: RO_0002233
  some values from: Class
    intersection of: ENVO_01000254
    intersection of: Restriction
      on property: BFO_0000051
      some values from: ENVO_00002006
subclass of: Restriction
  on property: RO_0002234
  some values from: Class
    intersection of: ENVO_01000254
    intersection of: Restriction
      on property: BFO_0000051
      some values from: ENVO_00002186
subclass of: ENVO_02500036
equivalent class: Class
  intersection of: ENVO_02500036
  intersection of: Class
    union of: ENVO_00000063
    union of: Restriction
      on property: BFO_0000066
      some values from: ENVO_00002006
subclass of: Restriction
  on property: RO_0002233
  some values from: Class
    intersection of: ENVO_01000254
    intersection of: Restriction
      on property: BFO_0000051
      some values from: ENVO_00002006
subclass of: Restriction
  on property: RO_0002234
  some values from: Class
    intersection of: ENVO_01000254
    intersection of: Restriction
      on property: BFO_0000051
      some values from: ENVO_00002186
equivalent class: Class
  intersection of: ENVO_02500036
  intersection of: Class
    union of: ENVO_00000063
    union of: Restriction
      on property: BFO_0000066
      some values from: ENVO_00002006

pollution control
type: Class
IAO_0000115: A planned process during which the amount of pollutants released into an environmental system is regulated.
has narrow synonym: pollution prevention
subclass of: Restriction
  on property: RO_0002211
  some values from: ENVO_02500036
subclass of: ENVO_02000178
equivalent class: Class
  intersection of: ENVO_02500026
  intersection of: Restriction
    on property: RO_0002211
    some values from: ENVO_02500036